Error C2027 Use Of Undefined Type

RECOMMENDED: If you have Windows errors then we strongly recommend that you download and run this (Windows) Repair Tool.

c++ – error C2027: use of undefined type 'edge' – Stack Overflow – I have this error occuring when trying to compile. I searched for help, but all answers focused on including separated files. But this is only one.cpp file, so it.

Aug 9, 2011. errors > Error 5 error C2027: use of undefined type > 'boost::python::detail:: specify_a_return_value_policy_to_wrap_functions_returning<T>'.

Error Operation Failed Domain Already Exists With Uuid [SOLVED] Error: domain already exists. Support. oscar. operation failed: domain 'one-22' already exists with uuid. check the /etc/libvirt/libvirtd.conf in the. In the last couple of months, I have noticed an increase in customer interests in using the Cross vCenter vMotion (xVC-vMotion) capability that was introduced back in. Action: Ensure that the Oracle Home location exists

When I do this: typedef function< void( Type const& ) > DestroyFunc; then. 10.0 vcincludefunctional(94): error C2027: use of undefined type

Error Number 0x800ccc79 In Outlook Express Outlook – Are you getting any error messages?" UPDATE ONE: Outlook users are. Sep 23, 2015  · Lists various error messages that you may receive when you send or receive email messages in Outlook or Outlook Express… Hi All I have a Groupshield 7 which is removing all my attachments from my quarentined email and replacing

Hi Vatsa_mitr, As «_Superman_» said, Starting Visual C++ 7.x, the new templatized version of the CString class is shipped with constructors that are.

I am creating classes for a program but I am getting an error – "error C2027: use of undefined type 'node'" – which points to the last line of this function

I have a class that I made that I am using in thread above the class. Even though I did a prototype of the class at the top it still throws off those errors error.

I'm passing a handle to form to a ref class. However, I can't use the handle in the ref class due to the form being an undefined type. I'm not sure how to.

Learn, Share, Build. Each month, over 50 million developers come to Stack Overflow to learn, share their knowledge, and build their careers. Join the world’s.

Even though I did a prototype of the class at the top it still throws off those errors error C2027: use of undefined type 'foo'. C++ class use of undefined type.

Aug 26, 2014. 1>c:usersjingfengdocumentsvisual studio 2010projectstestexceltestexcel debugexcel.tlh(7857): error C2027: use of undefined type.

error C2027: use of undefined type 'Ogre::OverlayElement'. ( which I'm not sure why it was missing ) to the header file and I still get the error.

error C2027: use of undefined type. C / C++ Forums on Bytes.

Aug 8, 2012. 1>GeneratedFilesDebugmoc_qextserialport.cpp(122): error C2027: use of undefined type 'QextSerialPortPrivate'

RECOMMENDED: Click here to fix Windows errors and improve system performance