Error Assignment Of Read-only Member _nlink

Strict Mode in JavaScript

RECOMMENDED: If you have Windows errors then we strongly recommend that you download and run this (Windows) Repair Tool.

Eliminate the assignment altogether. program Produce; const c = 1; procedure p(const s: string); begin s := ‘changed’; (*<– Error message here. you try to assign a value to a member of a record exposed by a read-only property.

Pakistani Urdu Forum for Free IT Education, ITDunya.com. Ajeeb o Ghareeb Assignment for Students. Calendar; Forum Actions. Mark Forums Read.

I can list all the libraries it is loading if necesarry. This certain error only happens if I launch animations on document.ready event but if I use.

VoIPFanRP: This is another issue. if the buyer and seller are not regular forum visitors, and don't read all of the posts (nuggets of information appear randomly.

This address is then assigned to the pointer variable pNumber , as its initial. Compiler flags out an error "assignment of read-only location" if it detected a.

X. You seem to have CSS turned off. Please don't fill out this field. You seem to have CSS turned off. Please don't fill out this field.

Not a member?. When the corresponding users clicks on the link they are getting access. task list but when they click on it getting "Access denied error". But in my scenario they are read only users, i don't want to assign.

Pear Db Error Connect Failed I could not connect to postgresql in php code whicih uses pear packet DB. Here is the error code : DB Error: connect failed [nativecode=Unable to connect to PostgreSQL server: could not connect to server: Permission denied Is the. Launched Job Failed To Run Return Error Code 0x0 0x5 Chapter 2. Introduction. Welcome, gentle reader.

In this state, a call to modify() will fail to compile: error: assignment of member ‘Example::m1’ in read-only object To make the code above compile, add mutable at line 2: mutable int m1; and it will compile.

Error Checking Vb6 Estimation Sampling Error The concept of ensemble forecasting is depicted schematically in the center of the above cover of Advances in Atmospheric Sciences, in which it is demonstrated. This online survey is not based on a probability sample and therefore no estimate. Sampling error – Wikipedia – In statistics, sampling error is the error caused

Static types for dynamically named properties – tests/cases/compiler/abstractPropertyNegative.ts(19,1): error TS2450: Left-hand side of assignment expression cannot be a constant or a read-only property. +tests/cases/compiler/abstractPropertyNegative.ts(19,3): error TS2540:.

Launched Job Failed To Run Return Error Code 0x0 0x5 Chapter 2. Introduction. Welcome, gentle reader. This document hopes to enlighten you on how to do more with Linux 2.2/2.4 routing. Unbeknownst to most users, you. Process 8152 failed to start due to Virtual Filesystem subsystem failure. Error code: 0xFD01F25-0x5. Failed to load runtime configurations. Changes in 5.0 This release comes with a new user

error assignment of member in read-only. error assignment of read-only member _nlink. error assignment of read-only member nlink p here for a quick overview.

InformIT – If you attempt to create a VCL object on the stack, the compiler will complain with the error message, VCL style classes must. They can make the data member read-only or write-only. Refer to Chapter 4, "Creating Custom.

About "error: assignment of data-member ‘A::pCost’ in read-only structure" – updatedCost = cost; // error as well pCost = updatedCost; // error: assignment of data-member ‘A::pCost’ } Line 24 "updatedCost = cost" is an error because you are trying to store a "CostType" to a double pointer. How is "CostType".

RECOMMENDED: Click here to fix Windows errors and improve system performance